{"text_format":"1","workbook":"xlsx","n_sheets":6,"sheets":["Instructions","Input & Report","Weibull Reliability Calculator","Probability Density Plot","Weibull Plot","Failure Forecast"],"not_rendered":{"charts":9,"images":11,"macros":1,"external_links":0,"defined_names":8,"comments":1,"pivot_tables":0},"unopened":[{"sheet":"Probability Density Plot","index":3,"reason":"not_a_worksheet"},{"sheet":"Weibull Plot","index":4,"reason":"not_a_worksheet"},{"sheet":"Failure Forecast","index":5,"reason":"not_a_worksheet"}],"bounds":{"document_bytes":16777216,"sheet_cells":100000,"rows_first":2000,"rows_last":500,"rows_between":2000,"halvings":0,"cell_chars":16384,"cell_head_chars":4096},"cells_cut":0,"cells_raw":0,"read":"whole","date_system":"1900"}

{"sheet":"Instructions","index":0,"n_rows":0,"n_cols":0,"rows_kept":0,"cut":false,"hidden":false,"merged":[]}

{"sheet":"Input & Report","index":1,"n_rows":112,"n_cols":17,"rows_kept":112,"cut":false,"hidden":false,"merged":[[20,15,20,18],[4,10,6,13],[110,4,112,8],[110,9,112,13],[107,4,109,8],[107,9,109,13],[8,15,8,18],[22,16,22,18],[23,16,23,18],[24,16,24,18],[26,15,26,18],[27,15,28,18],[29,15,30,18],[106,9,106,13],[19,4,20,9],[22,4,23,9],[19,12,20,12],[19,13,20,13],[10,10,11,11],[19,11,20,11],[2,5,2,6],[2,7,2,8],[10,4,11,9],[13,4,14,9],[16,4,17,9],[2,11,2,12],[13,10,14,11],[2,9,2,10],[22,10,23,11],[19,10,20,10],[28,11,29,11],[106,4,106,8],[8,10,8,11],[25,10,26,11],[28,10,29,10],[25,4,26,9],[28,4,29,9],[105,4,105,13],[22,12,23,13],[25,12,26,13],[28,12,29,12],[28,13,29,13],[8,12,8,13],[10,12,11,13],[14,15,14,18],[15,15,16,18],[17,15,18,18],[16,10,17,11],[10,16,10,18],[11,16,11,18],[12,16,12,18],[13,12,14,13],[16,12,17,13]]}
["Data Point","Cycles to Failure (Before)","Cycles to Failure (After)"]
[]
[null,null,null,null,null,"Clear Data",null,"Resize Table",null,"Sort Data",null,"Print Report"]
[]
[null,null,null,null,null,null,null,null,null,null,"Weibull Analysis"]
[]
[]
[]
[null,null,null,null,null,null,null,null,null,null,"Before",null,"After",null,null,"Before"]
[]
[null,null,null,null,"The maximum number of data points to be entered for analysis (overestimate if uncertain):",null,null,null,null,null,200,null,200,null,null,"Reliability",{"$f":"IF(K29>K20,\"Pass\",IF(K29<K20,\"Fail\",\"\"))","v":{"$error":"#VALUE!"}}]
[null,null,null,null,null,null,null,null,null,null,null,null,null,null,null,"Beta",{"$f":"IF(K23>1.2,\"greater than\",IF(K23<0.8,\"less than\",\"nearly equal to\"))","v":{"$error":"#VALUE!"}}]
[null,null,null,null,null,null,null,null,null,null,null,null,null,null,null,"Failure",{"$f":"IF(K23>1.2,\"normal wear out failure rate\",IF(K23<0.8,\"infant life failure rate\",\"a constant failure rate\"))","v":{"$error":"#VALUE!"}}]
[null,null,null,null,"Number of data points analyzed:",null,null,null,null,null,{"$f":"COUNT('Input & Report'!$B$2:$B$201)","v":0},{"$f":"COUNT('Input & Report'!$B$2:$B$201)","v":0},{"$f":"COUNT('Input & Report'!$C$2:$C$201)","v":0},{"$f":"COUNT('Input & Report'!$B$2:$B$201)","v":0}]
[null,null,null,null,null,null,null,null,null,null,{"$f":"COUNT('Input & Report'!$B$2:$B$201)","v":0},{"$f":"COUNT('Input & Report'!$B$2:$B$201)","v":0},{"$f":"COUNT('Input & Report'!$B$2:$B$201)","v":0},{"$f":"COUNT('Input & Report'!$B$2:$B$201)","v":0},null,"Possible Product Reliability Outcomes"]
[null,null,null,null,null,null,null,null,null,null,null,null,null,null,null,{"$f":"CONCATENATE(\"The product will meet or exceed the desired reliability of \",K20,\" percent at \",K17,\" cycles.\")","v":"The product will meet or exceed the desired reliability of 90 percent at 400000 cycles."}]
[null,null,null,null,"Enter the minimum number of cycles you desire the product to achieve: ",null,null,null,null,null,400000,null,40000]
[null,null,null,null,null,null,null,null,null,null,null,null,null,null,null,{"$f":"CONCATENATE(\"The product will not meet the desired reliability of \",K20,\" percent at \",K17,\" cycles.\")","v":"The product will not meet the desired reliability of 90 percent at 400000 cycles."}]
[]
[null,null,null,null,"Enter the percentage of product you wish to survive the desired number of cycles: ",null,null,null,null,null,90,"%",90,"%"]
[null,null,null,null,null,null,null,null,null,null,null,null,null,null,null,"After"]
[]
[null,null,null,null,"Shape Parameter, Beta: Infant life failures (< 1), wearing out (> 1), or constant failure rate (= 1)",null,null,null,null,null,{"$f":"'Weibull Reliability Calculator'!$H$9","v":{"$error":"#VALUE!"}},null,{"$f":"'Weibull Reliability Calculator'!$M$9","v":{"$error":"#VALUE!"}},null,null,"Reliability",{"$f":"IF(M29>M20,\"Pass\",IF(M29<M20,\"Fail\",\"\"))","v":{"$error":"#VALUE!"}}]
[null,null,null,null,null,null,null,null,null,null,null,null,null,null,null,"Beta",{"$f":"IF(M23>1.2,\"greater than\",IF(M23<0.8,\"less than\",\"nearly equal to\"))","v":{"$error":"#VALUE!"}}]
[null,null,null,null,null,null,null,null,null,null,null,null,null,null,null,"Failure",{"$f":"IF(M23>1.2,\"normal wear out failure rate\",IF(M23<0.8,\"infant life failure rate\",\"a constant failure rate\"))","v":{"$error":"#VALUE!"}}]
[null,null,null,null,"Characteristic Life, Alpha: The number of cycles at which 63.2% of the product will fail",null,null,null,null,null,{"$f":"'Weibull Reliability Calculator'!$H$10","v":{"$error":"#VALUE!"}},null,{"$f":"'Weibull Reliability Calculator'!$M$10","v":{"$error":"#VALUE!"}}]
[null,null,null,null,null,null,null,null,null,null,null,null,null,null,null,"Possible Product Reliability Outcomes"]
[null,null,null,null,null,null,null,null,null,null,null,null,null,null,null,{"$f":"CONCATENATE(\"The product will meet or exceed the desired reliability of \",M20,\" percent at \",M17,\" cycles.  \")","v":"The product will meet or exceed the desired reliability of 90 percent at 40000 cycles.  "}]
[null,null,null,null,{"$f":"CONCATENATE(\"Reliability at desired number of cycles\")","v":"Reliability at desired number of cycles"},null,null,null,null,null,{"$f":"(2.718^(-((K17/K26)^K23)))*100","v":{"$error":"#VALUE!"}},"%",{"$f":"(2.718^(-((M17/M26)^M23)))*100","v":{"$error":"#VALUE!"}},"%"]
[null,null,null,null,null,null,null,null,null,null,null,null,null,null,null,{"$f":"CONCATENATE(\"The product will not meet the desired reliability of \",M20,\" percent at \",M17,\" cycles.  \")","v":"The product will not meet the desired reliability of 90 percent at 40000 cycles.  "}]
{"$rows_left_out":83}
{"sheet":"Weibull Reliability Calculator","index":2,"n_rows":222,"n_cols":22,"rows_kept":222,"cut":false,"hidden":false,"merged":[[9,4,9,6],[20,0,20,1],[20,6,20,7],[20,15,20,16],[20,9,20,10],[20,11,20,14],[15,6,15,7],[16,18,16,19],[8,18,8,21],[0,18,0,21],[20,2,20,5],[11,6,11,7],[11,9,11,10],[11,4,11,5],[2,14,2,16],[15,9,15,10],[11,11,11,12],[2,0,2,2],[0,0,0,7],[0,9,0,16],[8,9,8,11],[9,9,9,11],[8,4,8,6]]}
["BEFORE DATA",null,null,null,null,null,null,null,null,"AFTER DATA",null,null,null,null,null,null,null,null,"BEFORE"]
[null,null,null,null,null,null,null,null,null,null,null,null,null,null,null,null,null,null,null,{"$f":"\"Column \"&SUBSTITUTE(ADDRESS(1,COLUMN(WeibullPlotData_BEFORE[[#Headers],[Cycles to failure]]),4),1,\"\")","v":"Column B"},{"$f":"\"Column \"&SUBSTITUTE(ADDRESS(1,COLUMN(WeibullPlotData_BEFORE[[#Headers],[ln(ln(1/(1-median rank)))]]),4),1,\"\")","v":"Column E"},{"$f":"\"Column \"&SUBSTITUTE(ADDRESS(1,COLUMN(WeibullPlotData_BEFORE[[#Headers],[ln(cycles)]]),4),1,\"\")","v":"Column F"}]
["Failure Forecast Data",null,null,null,null,null,null,null,null,null,null,null,null,null,"Failure Forecast Data",null,null,null,"Starting cell",{"$f":"\"$\"&RIGHT(T$2,1)&\"$\"&ROW(B$23)","v":"$B$23"},{"$f":"\"$\"&RIGHT(U$2,1)&\"$\"&ROW(E$23)","v":"$E$23"},{"$f":"\"$\"&RIGHT(V$2,1)&\"$\"&ROW(F$23)","v":"$F$23"}]
["Cycles","Failure Probability","Reliability",null,null,null,null,null,null,null,null,null,null,null,"Cycles","Failure Probability","Reliability",null,"Ending Cell",{"$f":"CONCATENATE(\"$\"&RIGHT(T$2,1)&\"$\",ROW($B$23)+$T$7-1)","v":"$B$22"},{"$f":"CONCATENATE(\"$\"&RIGHT(U$2,1)&\"$\",ROW($E$23)+$T$7-1)","v":"$E$22"},{"$f":"CONCATENATE(\"$\"&RIGHT(V$2,1)&\"$\",ROW($F$23)+$T$7-1)","v":"$F$22"}]
[{"$f":"H10/7","v":{"$error":"#VALUE!"}},{"$f":"IF(A5<>0,WEIBULL(A5,$H$9,$H$10,TRUE),\"\")","v":{"$error":"#VALUE!"}},{"$f":"IF(A5<>0,1-B5,\"\")","v":{"$error":"#VALUE!"}},null,null,null,null,null,null,null,null,null,null,null,{"$f":"M10/7","v":{"$error":"#VALUE!"}},{"$f":"IF(O5<>0,WEIBULL(O5,$M$9,$M$10,TRUE),\"\")","v":{"$error":"#VALUE!"}},{"$f":"IF(O5<>0,1-P5,\"\")","v":{"$error":"#VALUE!"}},null,"Range",{"$f":"CONCATENATE(T3,\":\",T4)","v":"$B$23:$B$22"},{"$f":"CONCATENATE(U3,\":\",U4)","v":"$E$23:$E$22"},{"$f":"CONCATENATE(V3,\":\",V4)","v":"$F$23:$F$22"}]
[{"$f":"2*(H10)/7","v":{"$error":"#VALUE!"}},{"$error":"#VALUE!"},{"$error":"#VALUE!"},null,null,null,null,null,null,null,null,null,null,null,{"$f":"2*(M10)/7","v":{"$error":"#VALUE!"}},{"$error":"#VALUE!"},{"$error":"#VALUE!"}]
[{"$f":"3*H10/7","v":{"$error":"#VALUE!"}},{"$error":"#VALUE!"},{"$error":"#VALUE!"},null,null,null,null,null,null,null,null,null,null,null,{"$f":"3*M10/7","v":{"$error":"#VALUE!"}},{"$error":"#VALUE!"},{"$error":"#VALUE!"},null,"# Samples: ",{"$f":"COUNT(WeibullPlotData_BEFORE[Cycles to failure])","v":0}]
[{"$f":"4*H10/7","v":{"$error":"#VALUE!"}},{"$error":"#VALUE!"},{"$error":"#VALUE!"},null,null,null,null,null,null,null,null,null,null,null,{"$f":"4*M10/7","v":{"$error":"#VALUE!"}},{"$error":"#VALUE!"},{"$error":"#VALUE!"}]
[{"$f":"5*H10/7","v":{"$error":"#VALUE!"}},{"$error":"#VALUE!"},{"$error":"#VALUE!"},null,"Beta (Shape Parameter)",null,null,{"$f":"SLOPE(INDIRECT('Weibull Reliability Calculator'!U5),INDIRECT('Weibull Reliability Calculator'!V5))","v":{"$error":"#VALUE!"}},null,"Beta (Shape Parameter)",null,null,{"$f":"SLOPE(INDIRECT('Weibull Reliability Calculator'!U13),INDIRECT('Weibull Reliability Calculator'!V13))","v":{"$error":"#VALUE!"}},null,{"$f":"5*M10/7","v":{"$error":"#VALUE!"}},{"$error":"#VALUE!"},{"$error":"#VALUE!"},null,"AFTER"]
[{"$f":"6*H10/7","v":{"$error":"#VALUE!"}},{"$error":"#VALUE!"},{"$error":"#VALUE!"},null,"Alpha (Characteristic Life)",null,null,{"$f":"EXP(-(INTERCEPT(INDIRECT('Weibull Reliability Calculator'!U5),INDIRECT('Weibull Reliability Calculator'!V5)))/H9)","v":{"$error":"#VALUE!"}},null,"Alpha (Characteristic Life)",null,null,{"$f":"EXP(-(INTERCEPT(INDIRECT('Weibull Reliability Calculator'!U13),INDIRECT('Weibull Reliability Calculator'!V13)))/M9)","v":{"$error":"#VALUE!"}},null,{"$f":"6*M10/7","v":{"$error":"#VALUE!"}},{"$error":"#VALUE!"},{"$error":"#VALUE!"},null,null,{"$f":"\"Column \"&SUBSTITUTE(ADDRESS(1,COLUMN(WeibullPlotData_AFTER[[#Headers],[Cycles to failure]]),4),1,\"\")","v":"Column K"},{"$f":"\"Column \"&SUBSTITUTE(ADDRESS(1,COLUMN(WeibullPlotData_AFTER[[#Headers],[ln(ln(1/(1-median rank)))]]),4),1,\"\")","v":"Column N"},{"$f":"\"Column \"&SUBSTITUTE(ADDRESS(1,COLUMN(WeibullPlotData_AFTER[[#Headers],[ln(cycles)]]),4),1,\"\")","v":"Column O"}]
[{"$f":"7*H10/7","v":{"$error":"#VALUE!"}},{"$error":"#VALUE!"},{"$error":"#VALUE!"},null,null,null,null,null,null,null,null,null,null,null,{"$f":"7*M10/7","v":{"$error":"#VALUE!"}},{"$error":"#VALUE!"},{"$error":"#VALUE!"},null,"Starting cell",{"$f":"\"$\"&RIGHT(T$10,1)&\"$\"&ROW(K$23)","v":"$K$23"},{"$f":"\"$\"&RIGHT(U$10,1)&\"$\"&ROW(N$23)","v":"$N$23"},{"$f":"\"$\"&RIGHT(V$10,1)&\"$\"&ROW(O$23)","v":"$O$23"}]
[{"$f":"8*H10/7","v":{"$error":"#VALUE!"}},{"$error":"#VALUE!"},{"$error":"#VALUE!"},null,"Reliability Table",null,"Probability Density",null,null,"Probability Density",null,"Reliability Table",null,null,{"$f":"8*M10/7","v":{"$error":"#VALUE!"}},{"$error":"#VALUE!"},{"$error":"#VALUE!"},null,"Ending Cell",{"$f":"CONCATENATE(\"$\"&RIGHT(T$10,1)&\"$\",ROW($K$23)+$T$15-1)","v":"$K$22"},{"$f":"CONCATENATE(\"$\"&RIGHT(U$10,1)&\"$\",ROW($N$23)+$T$15-1)","v":"$N$22"},{"$f":"CONCATENATE(\"$\"&RIGHT(V$10,1)&\"$\",ROW($O$23)+$T$15-1)","v":"$O$22"}]
[{"$f":"9*H10/7","v":{"$error":"#VALUE!"}},{"$error":"#VALUE!"},{"$error":"#VALUE!"},null,"Reliability","Cycles","Mean","Std Deviation",null,"Mean","Std Deviation","Reliability","Cycles",null,{"$f":"9*M10/7","v":{"$error":"#VALUE!"}},{"$error":"#VALUE!"},{"$error":"#VALUE!"},null,"Range",{"$f":"CONCATENATE(T11,\":\",T12)","v":"$K$23:$K$22"},{"$f":"CONCATENATE(U11,\":\",U12)","v":"$N$23:$N$22"},{"$f":"CONCATENATE(V11,\":\",V12)","v":"$O$23:$O$22"}]
[{"$f":"10*H$10/7","v":{"$error":"#VALUE!"}},{"$error":"#VALUE!"},{"$error":"#VALUE!"},null,0.01,{"$f":"'Weibull Reliability Calculator'!$H$10*(-LN(E14))^(1/'Weibull Reliability Calculator'!$H$9)","v":{"$error":"#VALUE!"}},{"$f":"AVERAGE(WeibullPlotData_BEFORE[Cycles to failure])","v":{"$error":"#DIV/0!"}},{"$f":"_xlfn.STDEV.P(WeibullPlotData_BEFORE[Cycles to failure])","v":{"$error":"#DIV/0!"}},null,{"$f":"AVERAGE(WeibullPlotData_AFTER[Cycles to failure])","v":{"$error":"#DIV/0!"}},{"$f":"_xlfn.STDEV.P(WeibullPlotData_AFTER[Cycles to failure])","v":{"$error":"#DIV/0!"}},0.01,{"$f":"'Weibull Reliability Calculator'!$M$10*(-LN(L14))^(1/'Weibull Reliability Calculator'!$M$9)","v":{"$error":"#VALUE!"}},null,{"$f":"10*M$10/7","v":{"$error":"#VALUE!"}},{"$error":"#VALUE!"},{"$error":"#VALUE!"}]
[{"$f":"11*H$10/7","v":{"$error":"#VALUE!"}},{"$error":"#VALUE!"},{"$error":"#VALUE!"},null,0.1,{"$f":"'Weibull Reliability Calculator'!$H$10*(-LN(E15))^(1/'Weibull Reliability Calculator'!$H$9)","v":{"$error":"#VALUE!"}},null,null,null,null,null,0.1,{"$f":"'Weibull Reliability Calculator'!$M$10*(-LN(L15))^(1/'Weibull Reliability Calculator'!$M$9)","v":{"$error":"#VALUE!"}},null,{"$f":"11*M$10/7","v":{"$error":"#VALUE!"}},{"$error":"#VALUE!"},{"$error":"#VALUE!"},null,"# Samples: ",{"$f":"COUNT(WeibullPlotData_AFTER[Cycles to failure])","v":0}]
[{"$f":"12*H$10/7","v":{"$error":"#VALUE!"}},{"$error":"#VALUE!"},{"$error":"#VALUE!"},null,0.5,{"$f":"'Weibull Reliability Calculator'!$H$10*(-LN(E16))^(1/'Weibull Reliability Calculator'!$H$9)","v":{"$error":"#VALUE!"}},"Characteristic Life Line",null,null,"Characteristic Life Line",null,0.5,{"$f":"'Weibull Reliability Calculator'!$M$10*(-LN(L16))^(1/'Weibull Reliability Calculator'!$M$9)","v":{"$error":"#VALUE!"}},null,{"$f":"12*M$10/7","v":{"$error":"#VALUE!"}},{"$error":"#VALUE!"},{"$error":"#VALUE!"}]
[{"$f":"13*H$10/7","v":{"$error":"#VALUE!"}},{"$error":"#VALUE!"},{"$error":"#VALUE!"},null,0.6321,{"$f":"'Weibull Reliability Calculator'!$H$10*(-LN(E17))^(1/'Weibull Reliability Calculator'!$H$9)","v":{"$error":"#VALUE!"}},"X","Y",null,"X","Y",0.6321,{"$f":"'Weibull Reliability Calculator'!$M$10*(-LN(L17))^(1/'Weibull Reliability Calculator'!$M$9)","v":{"$error":"#VALUE!"}},null,{"$f":"13*M$10/7","v":{"$error":"#VALUE!"}},{"$error":"#VALUE!"},{"$error":"#VALUE!"},null,"63.21% Line"]
[{"$f":"14*H$10/7","v":{"$error":"#VALUE!"}},{"$error":"#VALUE!"},{"$error":"#VALUE!"},null,0.9,{"$f":"'Weibull Reliability Calculator'!$H$10*(-LN(E18))^(1/'Weibull Reliability Calculator'!$H$9)","v":{"$error":"#VALUE!"}},{"$f":"$H$10","v":{"$error":"#VALUE!"}},0,null,{"$f":"$M$10","v":{"$error":"#VALUE!"}},0,0.9,{"$f":"'Weibull Reliability Calculator'!$M$10*(-LN(L18))^(1/'Weibull Reliability Calculator'!$M$9)","v":{"$error":"#VALUE!"}},null,{"$f":"14*M$10/7","v":{"$error":"#VALUE!"}},{"$error":"#VALUE!"},{"$error":"#VALUE!"},null,"X","Y"]
[{"$f":"15*H$10/7","v":{"$error":"#VALUE!"}},{"$error":"#VALUE!"},{"$error":"#VALUE!"},null,0.99,{"$f":"'Weibull Reliability Calculator'!$H$10*(-LN(E19))^(1/'Weibull Reliability Calculator'!$H$9)","v":{"$error":"#VALUE!"}},{"$f":"$H$10","v":{"$error":"#VALUE!"}},1,null,{"$f":"$M$10","v":{"$error":"#VALUE!"}},1,0.99,{"$f":"'Weibull Reliability Calculator'!$M$10*(-LN(L19))^(1/'Weibull Reliability Calculator'!$M$9)","v":{"$error":"#VALUE!"}},null,{"$f":"15*M$10/7","v":{"$error":"#VALUE!"}},{"$error":"#VALUE!"},{"$error":"#VALUE!"},null,0,0.63212055882855767]
[null,null,null,null,null,null,null,null,null,null,null,null,null,null,null,null,null,null,1,0.63212055882855767]
["Raw Data",null,"Weibull Data",null,null,null,"Probability Density Data",null,null,"Raw Data",null,"Weibull Data",null,null,null,"Probability Density Data"]
["Data Point","Cycles to failure","Rank","Median Rank","ln(ln(1/(1-median rank)))","ln(cycles)","X","Probability",null,"Data Point","Cycles to failure","Rank","Median Rank","ln(ln(1/(1-median rank)))","ln(cycles)","X","Probability"]
[{"$f":"IF(WeibullPlotData_BEFORE[Cycles to failure]<>\"\",COUNT(B$23:B23),\"\")","v":""},{"$f":"IF('Input & Report'!$B2<>\"\",'Input & Report'!$B2,\"\")","v":""},{"$f":"IF(B23=\"\",\"\",RANK(B23,INDIRECT('Weibull Reliability Calculator'!$T$5),1))","v":""},{"$f":"IF(B23=\"\",\"\",((C23-0.3)/($T$7+0.4)))","v":""},{"$f":"LN(LN((1/(1-D23))))","v":{"$error":"#VALUE!"}},{"$f":"LN(B23)","v":{"$error":"#VALUE!"}},{"$f":"IF(B23=\"\",\"\",G$14-(3*H$14)+(6*H$14)*(COUNT(B$23:B23)/COUNT(WeibullPlotData_BEFORE[Cycles to failure])))","v":""},{"$f":"IF(B23=\"\",\"\",NORMDIST(G23,G$14,H$14,FALSE))","v":""},null,{"$f":"IF(WeibullPlotData_AFTER[Cycles to failure]<>\"\",COUNT(K$23:K23),\"\")","v":""},{"$f":"IF('Input & Report'!$C2<>\"\",'Input & Report'!$C2,\"\")","v":""},{"$f":"IF(K23=\"\",\"\",RANK(K23,INDIRECT('Weibull Reliability Calculator'!$T$13),1))","v":""},{"$f":"IF(K23=\"\",\"\",((L23-0.3)/($T$15+0.4)))","v":""},{"$f":"LN(LN((1/(1-M23))))","v":{"$error":"#VALUE!"}},{"$f":"LN(K23)","v":{"$error":"#VALUE!"}},{"$f":"J$14-(3*K$14)+(6*K$14)*(COUNT(K$23:K23)/COUNT(WeibullPlotData_AFTER[Cycles to failure]))","v":{"$error":"#DIV/0!"}},{"$f":"IF(K23=\"\",\"\",NORMDIST(P23,J$14,K$14,FALSE))","v":""}]
[{"$f":"IF(WeibullPlotData_BEFORE[Cycles to failure]<>\"\",COUNT(B$23:B24),\"\")","v":""},{"$f":"IF('Input & Report'!$B3<>\"\",'Input & Report'!$B3,\"\")","v":""},{"$f":"IF(B24=\"\",\"\",RANK(B24,INDIRECT('Weibull Reliability Calculator'!$T$5),1))","v":""},"",{"$f":"LN(LN((1/(1-D24))))","v":{"$error":"#VALUE!"}},{"$f":"LN(B24)","v":{"$error":"#VALUE!"}},{"$f":"IF(B24=\"\",\"\",G$14-(3*H$14)+(6*H$14)*(COUNT(B$23:B24)/COUNT(WeibullPlotData_BEFORE[Cycles to failure])))","v":""},{"$f":"IF(B24=\"\",\"\",NORMDIST(G24,G$14,H$14,FALSE))","v":""},null,{"$f":"IF(WeibullPlotData_AFTER[Cycles to failure]<>\"\",COUNT(K$23:K24),\"\")","v":""},{"$f":"IF('Input & Report'!$C3<>\"\",'Input & Report'!$C3,\"\")","v":""},{"$f":"IF(K24=\"\",\"\",RANK(K24,INDIRECT('Weibull Reliability Calculator'!$T$13),1))","v":""},"",{"$f":"LN(LN((1/(1-M24))))","v":{"$error":"#VALUE!"}},{"$f":"LN(K24)","v":{"$error":"#VALUE!"}},{"$f":"J$14-(3*K$14)+(6*K$14)*(COUNT(K$23:K24)/COUNT(WeibullPlotData_AFTER[Cycles to failure]))","v":{"$error":"#DIV/0!"}},""]
[{"$f":"IF(WeibullPlotData_BEFORE[Cycles to failure]<>\"\",COUNT(B$23:B25),\"\")","v":""},{"$f":"IF('Input & Report'!$B4<>\"\",'Input & Report'!$B4,\"\")","v":""},{"$f":"IF(B25=\"\",\"\",RANK(B25,INDIRECT('Weibull Reliability Calculator'!$T$5),1))","v":""},"",{"$error":"#VALUE!"},{"$error":"#VALUE!"},{"$f":"IF(B25=\"\",\"\",G$14-(3*H$14)+(6*H$14)*(COUNT(B$23:B25)/COUNT(WeibullPlotData_BEFORE[Cycles to failure])))","v":""},"",null,{"$f":"IF(WeibullPlotData_AFTER[Cycles to failure]<>\"\",COUNT(K$23:K25),\"\")","v":""},{"$f":"IF('Input & Report'!$C4<>\"\",'Input & Report'!$C4,\"\")","v":""},{"$f":"IF(K25=\"\",\"\",RANK(K25,INDIRECT('Weibull Reliability Calculator'!$T$13),1))","v":""},"",{"$error":"#VALUE!"},{"$error":"#VALUE!"},{"$f":"J$14-(3*K$14)+(6*K$14)*(COUNT(K$23:K25)/COUNT(WeibullPlotData_AFTER[Cycles to failure]))","v":{"$error":"#DIV/0!"}},""]
[{"$f":"IF(WeibullPlotData_BEFORE[Cycles to failure]<>\"\",COUNT(B$23:B26),\"\")","v":""},{"$f":"IF('Input & Report'!$B5<>\"\",'Input & Report'!$B5,\"\")","v":""},{"$f":"IF(B26=\"\",\"\",RANK(B26,INDIRECT('Weibull Reliability Calculator'!$T$5),1))","v":""},"",{"$error":"#VALUE!"},{"$error":"#VALUE!"},{"$f":"IF(B26=\"\",\"\",G$14-(3*H$14)+(6*H$14)*(COUNT(B$23:B26)/COUNT(WeibullPlotData_BEFORE[Cycles to failure])))","v":""},"",null,{"$f":"IF(WeibullPlotData_AFTER[Cycles to failure]<>\"\",COUNT(K$23:K26),\"\")","v":""},{"$f":"IF('Input & Report'!$C5<>\"\",'Input & Report'!$C5,\"\")","v":""},{"$f":"IF(K26=\"\",\"\",RANK(K26,INDIRECT('Weibull Reliability Calculator'!$T$13),1))","v":""},"",{"$error":"#VALUE!"},{"$error":"#VALUE!"},{"$f":"J$14-(3*K$14)+(6*K$14)*(COUNT(K$23:K26)/COUNT(WeibullPlotData_AFTER[Cycles to failure]))","v":{"$error":"#DIV/0!"}},""]
[{"$f":"IF(WeibullPlotData_BEFORE[Cycles to failure]<>\"\",COUNT(B$23:B27),\"\")","v":""},{"$f":"IF('Input & Report'!$B6<>\"\",'Input & Report'!$B6,\"\")","v":""},{"$f":"IF(B27=\"\",\"\",RANK(B27,INDIRECT('Weibull Reliability Calculator'!$T$5),1))","v":""},"",{"$error":"#VALUE!"},{"$error":"#VALUE!"},{"$f":"IF(B27=\"\",\"\",G$14-(3*H$14)+(6*H$14)*(COUNT(B$23:B27)/COUNT(WeibullPlotData_BEFORE[Cycles to failure])))","v":""},"",null,{"$f":"IF(WeibullPlotData_AFTER[Cycles to failure]<>\"\",COUNT(K$23:K27),\"\")","v":""},{"$f":"IF('Input & Report'!$C6<>\"\",'Input & Report'!$C6,\"\")","v":""},{"$f":"IF(K27=\"\",\"\",RANK(K27,INDIRECT('Weibull Reliability Calculator'!$T$13),1))","v":""},"",{"$error":"#VALUE!"},{"$error":"#VALUE!"},{"$f":"J$14-(3*K$14)+(6*K$14)*(COUNT(K$23:K27)/COUNT(WeibullPlotData_AFTER[Cycles to failure]))","v":{"$error":"#DIV/0!"}},""]
[{"$f":"IF(WeibullPlotData_BEFORE[Cycles to failure]<>\"\",COUNT(B$23:B28),\"\")","v":""},{"$f":"IF('Input & Report'!$B7<>\"\",'Input & Report'!$B7,\"\")","v":""},{"$f":"IF(B28=\"\",\"\",RANK(B28,INDIRECT('Weibull Reliability Calculator'!$T$5),1))","v":""},"",{"$error":"#VALUE!"},{"$error":"#VALUE!"},{"$f":"IF(B28=\"\",\"\",G$14-(3*H$14)+(6*H$14)*(COUNT(B$23:B28)/COUNT(WeibullPlotData_BEFORE[Cycles to failure])))","v":""},"",null,{"$f":"IF(WeibullPlotData_AFTER[Cycles to failure]<>\"\",COUNT(K$23:K28),\"\")","v":""},{"$f":"IF('Input & Report'!$C7<>\"\",'Input & Report'!$C7,\"\")","v":""},{"$f":"IF(K28=\"\",\"\",RANK(K28,INDIRECT('Weibull Reliability Calculator'!$T$13),1))","v":""},"",{"$error":"#VALUE!"},{"$error":"#VALUE!"},{"$f":"J$14-(3*K$14)+(6*K$14)*(COUNT(K$23:K28)/COUNT(WeibullPlotData_AFTER[Cycles to failure]))","v":{"$error":"#DIV/0!"}},""]
[{"$f":"IF(WeibullPlotData_BEFORE[Cycles to failure]<>\"\",COUNT(B$23:B29),\"\")","v":""},{"$f":"IF('Input & Report'!$B8<>\"\",'Input & Report'!$B8,\"\")","v":""},{"$f":"IF(B29=\"\",\"\",RANK(B29,INDIRECT('Weibull Reliability Calculator'!$T$5),1))","v":""},"",{"$error":"#VALUE!"},{"$error":"#VALUE!"},{"$f":"IF(B29=\"\",\"\",G$14-(3*H$14)+(6*H$14)*(COUNT(B$23:B29)/COUNT(WeibullPlotData_BEFORE[Cycles to failure])))","v":""},"",null,{"$f":"IF(WeibullPlotData_AFTER[Cycles to failure]<>\"\",COUNT(K$23:K29),\"\")","v":""},{"$f":"IF('Input & Report'!$C8<>\"\",'Input & Report'!$C8,\"\")","v":""},{"$f":"IF(K29=\"\",\"\",RANK(K29,INDIRECT('Weibull Reliability Calculator'!$T$13),1))","v":""},"",{"$error":"#VALUE!"},{"$error":"#VALUE!"},{"$f":"J$14-(3*K$14)+(6*K$14)*(COUNT(K$23:K29)/COUNT(WeibullPlotData_AFTER[Cycles to failure]))","v":{"$error":"#DIV/0!"}},""]
[{"$f":"IF(WeibullPlotData_BEFORE[Cycles to failure]<>\"\",COUNT(B$23:B30),\"\")","v":""},{"$f":"IF('Input & Report'!$B9<>\"\",'Input & Report'!$B9,\"\")","v":""},{"$f":"IF(B30=\"\",\"\",RANK(B30,INDIRECT('Weibull Reliability Calculator'!$T$5),1))","v":""},"",{"$error":"#VALUE!"},{"$error":"#VALUE!"},{"$f":"IF(B30=\"\",\"\",G$14-(3*H$14)+(6*H$14)*(COUNT(B$23:B30)/COUNT(WeibullPlotData_BEFORE[Cycles to failure])))","v":""},"",null,{"$f":"IF(WeibullPlotData_AFTER[Cycles to failure]<>\"\",COUNT(K$23:K30),\"\")","v":""},{"$f":"IF('Input & Report'!$C9<>\"\",'Input & Report'!$C9,\"\")","v":""},{"$f":"IF(K30=\"\",\"\",RANK(K30,INDIRECT('Weibull Reliability Calculator'!$T$13),1))","v":""},"",{"$error":"#VALUE!"},{"$error":"#VALUE!"},{"$f":"J$14-(3*K$14)+(6*K$14)*(COUNT(K$23:K30)/COUNT(WeibullPlotData_AFTER[Cycles to failure]))","v":{"$error":"#DIV/0!"}},""]
{"$rows_left_out":192}